BDBM50024082 2-[(2-Isopropyl-2-methyl-cyclopropanecarbonyl)-amino]-but-2-enoic acid::CHEMBL274418
SMILES C\C=C(/NC(=O)C1CC1(C)C(C)C)C(O)=O
InChI Key InChIKey=KKCBZCHLCHUXCW-UITAMQMPSA-N
Data  1 KI
  Tab Delimited (TSV)   2D SDfile   Computed 3D by Vconf -m prep SDfile
Find this compound or compounds like it in BindingDB:
Activity Spreadsheet -- Enzyme Inhibition Constant Data from BindingDB
Found 1 hit for monomerid = 50024082
TargetDipeptidase 1(GUINEA PIG)
TBA
Curated by ChEMBL
LigandPNGBDBM50024082(2-[(2-Isopropyl-2-methyl-cyclopropanecarbonyl)-ami...)
Affinity DataKi:  3.00E+3nM. Assay description: Inhibitory activity against beta-lactamase renal dipeptidase
In DepthDetails ArticlePubMed