BDBM50024308 CHEMBL2112974
SMILES [H][C@@]12CNc3cc(OC)c(OC)cc3C1=NO[C@H]2CN1CCN(Cc2ccc(Cl)cc2)CC1
InChI Key InChIKey=DPWMWVBVQVDTJY-CVDCTZTESA-N
Data  3 KI
  Tab Delimited (TSV)   2D SDfile   Computed 3D by Vconf -m prep SDfile
Find this compound or compounds like it in BindingDB:
Activity Spreadsheet -- Enzyme Inhibition Constant Data from BindingDB
Found 3 hits for monomerid = 50024308
TargetAlpha-2C adrenergic receptor(Homo sapiens (Human))
Janssen-Cilag
Curated by ChEMBL
LigandPNGBDBM50024308(CHEMBL2112974)
Affinity DataKi:  23nM. Assay description: Binding affinity for alpha-2C adrenergic receptor
In DepthDetails ArticlePubMed
TargetSodium-dependent serotonin transporter(Homo sapiens (Human))
Janssen-Cilag
Curated by ChEMBL
LigandPNGBDBM50024308(CHEMBL2112974)
Affinity DataKi:  151nM. Assay description: Binding affinity for serotonin transporter
In DepthDetails ArticlePubMed
TargetAlpha-2A adrenergic receptor(Homo sapiens (Human))
Janssen-Cilag
Curated by ChEMBL
LigandPNGBDBM50024308(CHEMBL2112974)
Affinity DataKi: >1.00E+3nM. Assay description: Binding affinity for alpha-2A adrenergic receptor
In DepthDetails ArticlePubMed