BDBM50024389 CHEMBL370032
SMILES CCOCCOP(=O)(N1Cc2ccccc2C[C@@H]1C(=O)NO)c1ccc(OC)cc1
InChI Key InChIKey=GMNFREWQYNXZAF-UEWHNOOISA-N
Data  1 KI
  Tab Delimited (TSV)   2D SDfile   Computed 3D by Vconf -m prep SDfile
Find this compound or compounds like it in BindingDB:
Activity Spreadsheet -- Enzyme Inhibition Constant Data from BindingDB
Found 1 hit for monomerid = 50024389
TargetMatrix metalloproteinase-9(Homo sapiens (Human))
North Dakota State University
Curated by ChEMBL
LigandPNGBDBM50024389(CHEMBL370032)
Affinity DataKi:  6.40nM. Assay description: Inhibition of MOCAc-Pro-Leu-Gly-Leu-A2p (Dnp)-Ala-Arg-NH2 binding to human matrix metalloprotease-9 (MMP-9)
In DepthDetails ArticlePubMed