BDBM50024496 CHEMBL29412::Pyrimidin-5-yl-di-thiophen-2-yl-methanol
SMILES OC(c1cccs1)(c1cccs1)c1cncnc1
InChI Key InChIKey=JDOOHSDQFZOEPN-UHFFFAOYSA-N
Data  1 EC50
  Tab Delimited (TSV)   2D SDfile   Computed 3D by Vconf -m prep SDfile
Find this compound or compounds like it in BindingDB:
Activity Spreadsheet -- Enzyme Inhibition Constant Data from BindingDB
Found 1 hit for monomerid = 50024496
TargetAromatase(Rattus norvegicus)
TBA
Curated by ChEMBL
LigandPNGBDBM50024496(CHEMBL29412 | Pyrimidin-5-yl-di-thiophen-2-yl-meth...)
Affinity DataEC50: >2.00E+3nM. Assay description: In vitro inhibition of cytochrome P450 19A1 by rat ovarian microsomes incubated with [3H]androstenedione and NADPH-generating system.
In DepthDetails ArticlePubMed