BDBM50024506 (4-Chloro-phenyl)-phenyl-pyrimidin-5-yl-methanol::CHEMBL281217
SMILES OC(c1ccccc1)(c1ccc(Cl)cc1)c1cncnc1
InChI Key InChIKey=QJYBUDJACCWKFB-UHFFFAOYSA-N
Data  1 EC50
  Tab Delimited (TSV)   2D SDfile   Computed 3D by Vconf -m prep SDfile
Find this compound or compounds like it in BindingDB:
Activity Spreadsheet -- Enzyme Inhibition Constant Data from BindingDB
Found 1 hit for monomerid = 50024506
TargetAromatase(Rattus norvegicus)
TBA
Curated by ChEMBL
LigandPNGBDBM50024506((4-Chloro-phenyl)-phenyl-pyrimidin-5-yl-methanol |...)
Affinity DataEC50: >2.00E+3nM. Assay description: In vitro inhibition of cytochrome P450 19A1 by rat ovarian microsomes incubated with [3H]androstenedione and NADPH-generating system.
In DepthDetails ArticlePubMed