BDBM50024524 5-[1,1-Bis-(4-chloro-phenyl)-ethyl]-pyrimidine::CHEMBL29901
SMILES CC(c1ccc(Cl)cc1)(c1ccc(Cl)cc1)c1cncnc1
InChI Key InChIKey=PBJIUWJHFIQGEE-UHFFFAOYSA-N
Data  1 EC50
  Tab Delimited (TSV)   2D SDfile   Computed 3D by Vconf -m prep SDfile
Find this compound or compounds like it in BindingDB:
Activity Spreadsheet -- Enzyme Inhibition Constant Data from BindingDB
Found 1 hit for monomerid = 50024524
TargetAromatase(Rattus norvegicus)
TBA
Curated by ChEMBL
LigandPNGBDBM50024524(5-[1,1-Bis-(4-chloro-phenyl)-ethyl]-pyrimidine | C...)
Affinity DataEC50:  82nM. Assay description: In vitro inhibition of cytochrome P450 19A1 by rat ovarian microsomes incubated with [3H]androstenedione and NADPH-generating system.
In DepthDetails ArticlePubMed