BDBM50024593 (3-Methyl-butyl)-phosphonic acid::CHEMBL41600
SMILES CC(C)CCP(O)(O)=O
InChI Key InChIKey=OHMSWSFFCKZMGL-UHFFFAOYSA-N
Data  1 KI
PDB links: 1 PDB ID matches this monomer.
  Tab Delimited (TSV)   2D SDfile   Computed 3D by Vconf -m prep SDfile
Find this compound or compounds like it in BindingDB:
Activity Spreadsheet -- Enzyme Inhibition Constant Data from BindingDB
Found 1 hit for monomerid = 50024593
TargetCytosol aminopeptidase(Homo sapiens (Human))
TBA
Curated by ChEMBL
LigandPNGBDBM50024593((3-Methyl-butyl)-phosphonic acid | CHEMBL41600)
Affinity DataKi:  7.75E+5nM. Assay description: Inhibition of Leucine aminopeptidase isolated from porcine kidney.
In DepthDetails ArticlePubMed