BDBM50024900 CHEMBL3335029
SMILES O=c1oc2cc(OCCN3CCN(Cc4ccccc4)CC3)ccc2c2CCCCc12
InChI Key InChIKey=OHDDRPINWQDGEH-UHFFFAOYSA-N
Data  2 IC50
  Tab Delimited (TSV)   2D SDfile   Computed 3D by Vconf -m prep SDfile
Find this compound or compounds like it in BindingDB:
Activity Spreadsheet -- Enzyme Inhibition Constant Data from BindingDB
Found 2 hits for monomerid = 50024900
TargetCholinesterase(Homo sapiens (Human))
Eastern Mediterranean University
Curated by ChEMBL
LigandPNGBDBM50024900(CHEMBL3335029)
Affinity DataIC50:  3.20E+4nM. Assay description: Inhibition of human recombinant BuChE using butyrylthiocholine iodide substrate incubated for 15 mins by spectrophotometry based Ellman's method
In DepthDetails ArticlePubMed
TargetAcetylcholinesterase(Homo sapiens (Human))
Eastern Mediterranean University
Curated by ChEMBL
LigandPNGBDBM50024900(CHEMBL3335029)
Affinity DataIC50:  1.30E+3nM. Assay description: Inhibition of human recombinant AChE using acetylthiocholine iodide substrate incubated for 15 mins by spectrophotometry based Ellman's method
In DepthDetails ArticlePubMed