BDBM50024960 CHEMBL3335073
SMILES [Br-].C[n+]1ccccc1\C=N\O
InChI Key InChIKey=UHVXAXRWEJONPZ-UHFFFAOYSA-N
Data  1 Kd
  Tab Delimited (TSV)   2D SDfile   Computed 3D by Vconf -m prep SDfile
Find this compound or compounds like it in BindingDB:
Activity Spreadsheet -- Enzyme Inhibition Constant Data from BindingDB
Found 1 hit for monomerid = 50024960
TargetAcetylcholinesterase(Homo sapiens (Human))
Pt. Ravishankar Shukla University
Curated by ChEMBL
LigandPNGBDBM50024960(CHEMBL3335073)
Affinity DataKd:  8.81E+3nM. Assay description: Binding affinity to paraoxon-inhibited AChE (unknown origin)
In DepthDetails ArticlePubMed