BDBM50024994 3-Isobutoxy-4,5,6,7-tetrahydro-isoxazolo[4,5-c]pyridin-5-ium; chloride::CHEMBL6377
SMILES CC(C)COc1noc2CC[NH2+]Cc12
InChI Key InChIKey=MGVMWYVQRFMITC-UHFFFAOYSA-O
Data  2 IC50  1 EC50
  Tab Delimited (TSV)   2D SDfile   Computed 3D by Vconf -m prep SDfile
Find this compound or compounds like it in BindingDB:
Activity Spreadsheet -- Enzyme Inhibition Constant Data from BindingDB
Found 3 hits for monomerid = 50024994
TargetMuscarinic acetylcholine receptor M3(Homo sapiens (Human))
TBA
Curated by ChEMBL
LigandPNGBDBM50024994(3-Isobutoxy-4,5,6,7-tetrahydro-isoxazolo[4,5-c]pyr...)
Affinity DataEC50: >5.00E+4nM. Assay description: Contraction of guinea pig ileum by muscarinic AChR activation, which could be inhibited by application of atropine
In DepthDetails ArticlePubMed
LigandPNGBDBM50024994(3-Isobutoxy-4,5,6,7-tetrahydro-isoxazolo[4,5-c]pyr...)
Affinity DataIC50: >5.00E+4nM. Assay description: Inhibition of binding of radioactive N-propylbenzilycholine mustard ([3H]-PrBCM) to rat brain membranes
In DepthDetails ArticlePubMed
TargetMuscarinic acetylcholine receptor M1/M2/M3/M4/M5(Homo sapiens (Human))
TBA
Curated by ChEMBL
LigandPNGBDBM50024994(3-Isobutoxy-4,5,6,7-tetrahydro-isoxazolo[4,5-c]pyr...)
Affinity DataIC50:  4.90E+4nM. Assay description: In vitro inhibition of Angiotensin I converting enzyme activity in rabbit lung
In DepthDetails ArticlePubMed