BDBM50025031 CHEMBL3337863
SMILES [Br-].[Br-].[H][C@@]12C[C@@]3([H])[C@H](CC)C[N+]1(CC=C)CC[C@@]21c2ccccc2N2\C=C4/[C@]5([H])N(\C=C3/[C@@]12[H])c1ccccc1[C@@]51CC[N+]2(CC=C)C[C@@H](CCO)[C@]4([H])C[C@@]12[H]
InChI Key InChIKey=IJIRRGHTZSHFPY-SKYHGZCBSA-L
Data  2 IC50  2 EC50
  Tab Delimited (TSV)   2D SDfile   Computed 3D by Vconf -m prep SDfile
Find this compound or compounds like it in BindingDB:
Activity Spreadsheet -- Enzyme Inhibition Constant Data from BindingDB
Found 4 hits for monomerid = 50025031
TargetMuscarinic acetylcholine receptor M2(GUINEA PIG)
The German University In Cairo
Curated by ChEMBL
LigandPNGBDBM50025031(CHEMBL3337863)
Affinity DataEC50:  12nM. Assay description: Displacement of [3H]NMS from pig muscarinic M2 receptor after 120 mins by liquid scintillation counting
In DepthDetails ArticlePubMed
TargetNeuronal acetylcholine receptor subunit alpha-7(Homo sapiens (Human))
The German University In Cairo
Curated by ChEMBL
LigandPNGBDBM50025031(CHEMBL3337863)
Affinity DataIC50:  3.16E+3nM. Assay description: Antagonist activity at human alpha7 nAChR expressed in GH3 cells by Ca2+/Fluo-4 assay
In DepthDetails ArticlePubMed
TargetMuscarinic acetylcholine receptor M2(GUINEA PIG)
The German University In Cairo
Curated by ChEMBL
LigandPNGBDBM50025031(CHEMBL3337863)
Affinity DataEC50:  12nM. Assay description: Displacement of [3H]NMS from pig muscarinic M2 receptor after 120 mins by liquid scintillation counting
In DepthDetails ArticlePubMed
TargetNeuronal acetylcholine receptor subunit alpha-7(Homo sapiens (Human))
The German University In Cairo
Curated by ChEMBL
LigandPNGBDBM50025031(CHEMBL3337863)
Affinity DataIC50:  3.10E+3nM. Assay description: Antagonist activity at human alpha7 nAChR expressed in GH3 cells by Ca2+/Fluo-4 assay
In DepthDetails ArticlePubMed