BDBM50025035 CHEMBL3337859
SMILES [Br-].[Br-].[H][C@]12C[C@@]3([H])C4=CO[C@@]5([H])N6c7ccccc7[C@@]78CC[N+]9(CC=C)CC%10=CCO[C@@]([H])(N%11c%12ccccc%12[C@@]1(CC[N+]2(CC=C)C4)[C@]%11([H])[C@@]35[H])[C@@]([H])([C@]67[H])[C@@]%10([H])C[C@@]89[H]
InChI Key InChIKey=CGXQWTJFJFBOAR-SIESTWEESA-N
Data  1 EC50
  Tab Delimited (TSV)   2D SDfile   Computed 3D by Vconf -m prep SDfile
Find this compound or compounds like it in BindingDB:
Activity Spreadsheet -- Enzyme Inhibition Constant Data from BindingDB
Found 1 hit for monomerid = 50025035
TargetMuscarinic acetylcholine receptor M2(GUINEA PIG)
The German University In Cairo
Curated by ChEMBL
LigandPNGBDBM50025035(CHEMBL3337859)
Affinity DataEC50:  11nM. Assay description: Displacement of [3H]NMS from pig muscarinic M2 receptor after 120 mins by liquid scintillation counting
In DepthDetails ArticlePubMed