BDBM50025160 CHEMBL3337894
SMILES COc1cccc(CNC(=O)c2nc3scc(COCc4ccc(cc4)C(O)=O)c3c(=O)[nH]2)c1
InChI Key InChIKey=CDQRIIUMNLMHRH-UHFFFAOYSA-N
Data  14 IC50
  Tab Delimited (TSV)   2D SDfile   Computed 3D by Vconf -m prep SDfile
Find this compound or compounds like it in BindingDB:
Activity Spreadsheet -- Enzyme Inhibition Constant Data from BindingDB
Found 14 hits for monomerid = 50025160
TargetInterstitial collagenase(Homo sapiens (Human))
Takeda Pharmaceutical
Curated by ChEMBL
LigandPNGBDBM50025160(CHEMBL3337894)
Affinity DataIC50: >1.00E+4nM. Assay description: Inhibition of human recombinant MMP1 using fluorescence peptide Cy3-PLGLK(Cy5Q)AR-NH2 substrate by fluorescence assay
In DepthDetails ArticlePubMed
Target72 kDa type IV collagenase(Homo sapiens (Human))
Takeda Pharmaceutical
Curated by ChEMBL
LigandPNGBDBM50025160(CHEMBL3337894)
Affinity DataIC50:  18nM. Assay description: Inhibition of human recombinant MMP2 using fluorescence peptide Cy3-PLGLK(Cy5Q)AR-NH2 substrate by fluorescence assay
In DepthDetails ArticlePubMed
TargetStromelysin-1(Homo sapiens (Human))
Takeda Pharmaceutical
Curated by ChEMBL
LigandPNGBDBM50025160(CHEMBL3337894)
Affinity DataIC50:  600nM. Assay description: Inhibition of human recombinant MMP3 using fluorescence peptide Cy3-PLGLK(Cy5Q)AR-NH2 substrate by fluorescence assay
In DepthDetails ArticlePubMed
TargetMatrilysin(Homo sapiens (Human))
Takeda Pharmaceutical
Curated by ChEMBL
LigandPNGBDBM50025160(CHEMBL3337894)
Affinity DataIC50: >1.00E+4nM. Assay description: Inhibition of human recombinant MMP7 using fluorescence peptide Cy3-PLGLK(Cy5Q)AR-NH2 substrate by fluorescence assay
In DepthDetails ArticlePubMed
TargetNeutrophil collagenase(Homo sapiens (Human))
Takeda Pharmaceutical
Curated by ChEMBL
LigandPNGBDBM50025160(CHEMBL3337894)
Affinity DataIC50:  780nM. Assay description: Inhibition of human recombinant MMP8 using fluorescence peptide Cy3-PLGLK(Cy5Q)AR-NH2 substrate by fluorescence assay
In DepthDetails ArticlePubMed
TargetMatrix metalloproteinase-9(Homo sapiens (Human))
Takeda Pharmaceutical
Curated by ChEMBL
LigandPNGBDBM50025160(CHEMBL3337894)
Affinity DataIC50: >1.00E+4nM. Assay description: Inhibition of human recombinant MMP9 using fluorescence peptide Cy3-PLGLK(Cy5Q)AR-NH2 substrate by fluorescence assay
In DepthDetails ArticlePubMed
TargetStromelysin-2(Homo sapiens (Human))
Zhaw Zurich University Of Applied Sciences
Curated by ChEMBL
LigandPNGBDBM50025160(CHEMBL3337894)
Affinity DataIC50:  358nM. Assay description: Inhibition of C-terminal tagged human recombinant MMP13 catalytic domain expressed in Escherichia coli using (5-FAM/QX) FRET peptide as substrate by ...
In DepthDetails ArticlePubMed
TargetMatrix metalloproteinase-14(Homo sapiens (Human))
Takeda Pharmaceutical
Curated by ChEMBL
LigandPNGBDBM50025160(CHEMBL3337894)
Affinity DataIC50: >1.00E+4nM. Assay description: Inhibition of human recombinant MMP14 using fluorescence peptide Cy3-PLGLK(Cy5Q)AR-NH2 substrate by fluorescence assay
In DepthDetails ArticlePubMed
TargetDisintegrin and metalloproteinase domain-containing protein 17(Homo sapiens (Human))
Takeda Pharmaceutical
Curated by ChEMBL
LigandPNGBDBM50025160(CHEMBL3337894)
Affinity DataIC50: >1.00E+4nM. Assay description: Inhibition of human recombinant TACE using Cy3-PLAQAV(Cy5QL-2,3-diaminopropionic acid)-RSSSR-NH2 substrate by fluorescence assay
In DepthDetails ArticlePubMed
TargetCollagenase 3(Homo sapiens (Human))
Takeda Pharmaceutical
Curated by ChEMBL
LigandPNGBDBM50025160(CHEMBL3337894)
Affinity DataIC50:  0.00690nM. Assay description: Inhibition of human recombinant MMP13 catalytic domain using fluorescence peptide Cy3-PLGLK(Cy5Q)AR-NH2 substrate by fluorescence assay
In DepthDetails ArticlePubMed
TargetStromelysin-2(Homo sapiens (Human))
Zhaw Zurich University Of Applied Sciences
Curated by ChEMBL
LigandPNGBDBM50025160(CHEMBL3337894)
Affinity DataIC50:  358nM. Assay description: Inhibition of MMP10 (unknown origin) assessed using (5-FAM/QX) FRET peptide as substrate by fluorescence assay
In DepthDetails ArticlePubMed
TargetCollagenase 3(Homo sapiens (Human))
Takeda Pharmaceutical
Curated by ChEMBL
LigandPNGBDBM50025160(CHEMBL3337894)
Affinity DataIC50:  0.190nM. Assay description: Inhibition of C-terminal tagged human recombinant MMP13 catalytic domain expressed in Escherichia coli using (5-FAM/QX) FRET peptide as substrate by ...
In DepthDetails ArticlePubMed
TargetCollagenase 3(Homo sapiens (Human))
Takeda Pharmaceutical
Curated by ChEMBL
LigandPNGBDBM50025160(CHEMBL3337894)
Affinity DataIC50:  0.190nM. Assay description: Inhibition of C-terminal tagged human recombinant MMP13 catalytic domain expressed in Escherichia coli using (5-FAM/QX) FRET peptide as substrate by ...
In DepthDetails ArticlePubMed
TargetStromelysin-2(Homo sapiens (Human))
Zhaw Zurich University Of Applied Sciences
Curated by ChEMBL
LigandPNGBDBM50025160(CHEMBL3337894)
Affinity DataIC50:  160nM. Assay description: Inhibition of human recombinant MMP10 using fluorescence peptide Cy3-PLGLK(Cy5Q)AR-NH2 substrate by fluorescence assay
In DepthDetails ArticlePubMed