BDBM50025467 2-(N-dipropylamino)quinoline::CHEMBL78878::Dipropyl-quinolin-2-yl-amine
SMILES CCCN(CCC)c1ccc2ccccc2n1
InChI Key InChIKey=NSHKIGSAABRNSY-UHFFFAOYSA-N
Data  2 KI
  Tab Delimited (TSV)   2D SDfile   Computed 3D by Vconf -m prep SDfile
Find this compound or compounds like it in BindingDB:
Activity Spreadsheet -- Enzyme Inhibition Constant Data from BindingDB
Found 2 hits for monomerid = 50025467
Target5-hydroxytryptamine receptor 3A(RAT)
Virginia Commonwealth University
Curated by PDSP Ki Database
LigandPNGBDBM50025467(2-(N-dipropylamino)quinoline | CHEMBL78878 | Dipro...)
Affinity DataKi:  1.00E+3nM
In DepthDetails ArticlePubMed
TargetSerotonin 2 (5-HT2) receptor(RAT)
TBA
Curated by ChEMBL
LigandPNGBDBM50025467(2-(N-dipropylamino)quinoline | CHEMBL78878 | Dipro...)
Affinity DataKi:  5.00E+4nM. Assay description: Displacement of [3H]ketanserin from 5-hydroxytryptamine 2 receptor of rat cortical membrane homogenates
In DepthDetails ArticlePubMed