BDBM50025489 1-[3-(4-Methoxy-phenyl)-propyl]-1,3-dihydro-imidazole-2-thione::CHEMBL82009
SMILES COc1ccc(CCCn2cc[nH]c2=S)cc1
InChI Key InChIKey=HITFRMWXCPNROA-UHFFFAOYSA-N
Data  1 IC50
  Tab Delimited (TSV)   2D SDfile   Computed 3D by Vconf -m prep SDfile
Find this compound or compounds like it in BindingDB:
Activity Spreadsheet -- Enzyme Inhibition Constant Data from BindingDB
Found 1 hit for monomerid = 50025489
TargetDopamine beta-hydroxylase(Bos taurus)
TBA
Curated by ChEMBL
LigandPNGBDBM50025489(1-[3-(4-Methoxy-phenyl)-propyl]-1,3-dihydro-imidaz...)
Affinity DataIC50:  1.80E+5nM. Assay description: Inhibition of Dopamine beta hydroxylase.
In DepthDetails ArticlePubMed