BDBM50025542 3-Hydroxy-4-{3-methyl-2-[3-methyl-2-(3-methyl-butyrylamino)-butyrylamino]-butyrylamino}-5-phenyl-pentanoic acid [1-(3-methyl-butylcarbamoyl)-ethyl]-amide::CHEMBL3392098
SMILES CC(C)CCNC(=O)[C@H](C)NC(=O)C[C@H](O)[C@H](Cc1ccccc1)NC(=O)[C@@H](NC(=O)[C@@H](NC(=O)CC(C)C)C(C)C)C(C)C
InChI Key InChIKey=DSUDGIUWJOYCMK-AFNKLIEYSA-N
Data  1 KI
  Tab Delimited (TSV)   2D SDfile   Computed 3D by Vconf -m prep SDfile
Find this compound or compounds like it in BindingDB:
Activity Spreadsheet -- Enzyme Inhibition Constant Data from BindingDB
Found 1 hit for monomerid = 50025542
TargetCathepsin D(Bos taurus)
TBA
Curated by ChEMBL
LigandPNGBDBM50025542(3-Hydroxy-4-{3-methyl-2-[3-methyl-2-(3-methyl-buty...)
Affinity DataKi:  1nM. Assay description: Inhibition of cathepsin D.
In DepthDetails ArticlePubMed