BDBM50025558 CHEMBL519022
SMILES COc1cc(cc(OC)c1OC)-c1cc(=O)c2cc(O)ccc2o1
InChI Key InChIKey=ZSGFQNBMEKWZEV-UHFFFAOYSA-N
Data  1 IC50
  Tab Delimited (TSV)   2D SDfile   Computed 3D by Vconf -m prep SDfile
Find this compound or compounds like it in BindingDB:
Activity Spreadsheet -- Enzyme Inhibition Constant Data from BindingDB
Found 1 hit for monomerid = 50025558
TargetTyrosine-protein kinase Lck(Homo sapiens (Human))
TBA
Curated by ChEMBL
LigandPNGBDBM50025558(CHEMBL519022)
Affinity DataIC50:  6.09E+4nM. Assay description: Inhibition of p56 lck
In DepthDetails ArticlePubMed