BDBM50025731 15-Hydroxy-icosa-11,13-dienoic acid::CHEMBL439584
SMILES CCCCCC(O)\C=C/C=C/CCCCCCCCCC(O)=O
InChI Key InChIKey=ZTRWPEHMGCHTIT-YSNXYNCHSA-N
Data  1 IC50
  Tab Delimited (TSV)   2D SDfile   Computed 3D by Vconf -m prep SDfile
Find this compound or compounds like it in BindingDB:
Activity Spreadsheet -- Enzyme Inhibition Constant Data from BindingDB
Found 1 hit for monomerid = 50025731
TargetPolyunsaturated fatty acid 5-lipoxygenase(Rattus norvegicus)
TBA
Curated by ChEMBL
LigandPNGBDBM50025731(15-Hydroxy-icosa-11,13-dienoic acid | CHEMBL439584)
Affinity DataIC50:  5.80E+4nM. Assay description: Inhibition of rat basophilic leukemia-1 (RBL-1) 5-lipoxygenase
In DepthDetails ArticlePubMed