BDBM50025955 5-[5-(1H-Tetrazol-5-yl)-pentyl]-imidazo[1,5-a]pyridine; hydrochloride::CHEMBL544722
SMILES C(CCc1nnn[nH]1)CCc1cccc2cncn12
InChI Key InChIKey=ISJDAKISMVDDNH-UHFFFAOYSA-N
Data  1 IC50
  Tab Delimited (TSV)   2D SDfile   Computed 3D by Vconf -m prep SDfile
Find this compound or compounds like it in BindingDB:
Activity Spreadsheet -- Enzyme Inhibition Constant Data from BindingDB
Found 1 hit for monomerid = 50025955
TargetThromboxane-A synthase(Homo sapiens (Human))
TBA
Curated by ChEMBL
LigandPNGBDBM50025955(5-[5-(1H-Tetrazol-5-yl)-pentyl]-imidazo[1,5-a]pyri...)
Affinity DataIC50:  19nM. Assay description: In vitro inhibition of thromboxane A2 synthetase from human platelets.
In DepthDetails ArticlePubMed