BDBM50026080 CHEMBL1270311
SMILES Clc1ccsc1C(=O)OCC#CCSc1nnc(o1)-c1cccc2ccccc12
InChI Key InChIKey=JMUKWVCHLKIZFA-UHFFFAOYSA-N
Data  1 KI
  Tab Delimited (TSV)   2D SDfile   Computed 3D by Vconf -m prep SDfile
Find this compound or compounds like it in BindingDB:
Activity Spreadsheet -- Enzyme Inhibition Constant Data from BindingDB
Found 1 hit for monomerid = 50026080
TargetPolyunsaturated fatty acid lipoxygenase ALOX15(Homo sapiens (Human))
National Human Genome Research Institute
Curated by ChEMBL
LigandPNGBDBM50026080(CHEMBL1270311)
Affinity DataKi: <10nM. Assay description: Inhibition of human N-terminal His6-tagged reticulocyte 15-lipoxygenase-1 after 15 mins by UV-vis spectrophotometer analysis
In DepthDetails ArticlePubMed