BDBM50026142 4-Hydroxy-6-[2-(3,5,3',4'-tetrachloro-biphenyl-2-yl)-vinyl]-tetrahydro-pyran-2-one::CHEMBL2368986
SMILES O[C@@H]1C[C@H](OC(=O)C1)\C=C\c1c(Cl)cc(Cl)cc1-c1ccc(Cl)c(Cl)c1
InChI Key InChIKey=VRXHJOZTXMVLIU-XCUNLHGCSA-N
Data  1 IC50
  Tab Delimited (TSV)   2D SDfile   Computed 3D by Vconf -m prep SDfile
Find this compound or compounds like it in BindingDB:
Activity Spreadsheet -- Enzyme Inhibition Constant Data from BindingDB
Found 1 hit for monomerid = 50026142
Target3-hydroxy-3-methylglutaryl-coenzyme A reductase(Rattus norvegicus (rat))
TBA
Curated by ChEMBL
LigandPNGBDBM50026142(4-Hydroxy-6-[2-(3,5,3',4'-tetrachloro-biphenyl-2-y...)
Affinity DataIC50:  25nM. Assay description: Inhibition of solubilized partially purified rat liver HMG-CoA reductase
In DepthDetails ArticlePubMed