BDBM50026313 5-[4-(2,4-Diamino-pyrimidin-5-ylmethyl)-2,6-dimethoxy-phenoxy]-pentanoic acid::CHEMBL321942
SMILES COc1cc(Cc2cnc(N)nc2N)cc(OC)c1OCCCCC(O)=O
InChI Key InChIKey=RWXBLUCACALTEE-UHFFFAOYSA-N
Data  1 KI
  Tab Delimited (TSV)   2D SDfile   Computed 3D by Vconf -m prep SDfile
Find this compound or compounds like it in BindingDB:
Activity Spreadsheet -- Enzyme Inhibition Constant Data from BindingDB
Found 1 hit for monomerid = 50026313
TargetDihydrofolate reductase(Escherichia coli)
TBA
Curated by ChEMBL
LigandPNGBDBM50026313(5-[4-(2,4-Diamino-pyrimidin-5-ylmethyl)-2,6-dimeth...)
Affinity DataKi:  2.20nM. Assay description: Binding affinity against Dihydrofolate reductase of Escherichia coli
In DepthDetails ArticlePubMed