BDBM50026464 2-(5,6-Dihydroxy-7-methyl-1H-indol-3-yl)-ethyl-ammonium
SMILES Cc1c(O)c(O)cc2c(CC[NH3+])c[nH]c12
InChI Key InChIKey=VWUOXRPBZMPVCU-UHFFFAOYSA-O
Data  1 IC50
  Tab Delimited (TSV)   2D SDfile   Computed 3D by Vconf -m prep SDfile
Find this compound or compounds like it in BindingDB:
Activity Spreadsheet -- Enzyme Inhibition Constant Data from BindingDB
Found 1 hit for monomerid = 50026464
TargetSodium-dependent serotonin transporter(Rattus norvegicus (rat))
TBA
Curated by ChEMBL
LigandPNGBDBM50026464(2-(5,6-Dihydroxy-7-methyl-1H-indol-3-yl)-ethyl-amm...)
Affinity DataIC50:  5.18E+4nM. Assay description: Inhibitory activity against incorporation of [3H]5-HT transporter uptake into the differentiated N-2a cells.
In DepthDetails ArticlePubMed