BDBM50026678 CHEMBL3335374
SMILES CC(=O)Nc1cc(Oc2ccc3n(C)c(Nc4cccc(OC(F)(F)F)c4)nc3c2)ccn1
InChI Key InChIKey=HGJCYDGGRLXLFD-UHFFFAOYSA-N
Data  1 IC50  1 EC50
  Tab Delimited (TSV)   2D SDfile   Computed 3D by Vconf -m prep SDfile
Find this compound or compounds like it in BindingDB:
Activity Spreadsheet -- Enzyme Inhibition Constant Data from BindingDB
Found 2 hits for monomerid = 50026678
TargetSerine/threonine-protein kinase B-raf(Homo sapiens (Human))
Novartis Institutes For Biomedical Research
Curated by ChEMBL
LigandPNGBDBM50026678(CHEMBL3335374)
Affinity DataIC50:  0.400nM. Assay description: Inhibition of BRAF V600E mutant (unknown origin)
In DepthDetails ArticlePubMed
TargetSerine/threonine-protein kinase B-raf(Homo sapiens (Human))
Novartis Institutes For Biomedical Research
Curated by ChEMBL
LigandPNGBDBM50026678(CHEMBL3335374)
Affinity DataEC50:  100nM. Assay description: Inhibition of BRAF (unknown origin)-mediated ERK phosphorylation by cell-based assay
In DepthDetails ArticlePubMed