BDBM50026694 CHEMBL3335375
SMILES CC(=O)Nc1cc(Oc2ccc3n(C)c(Nc4cccc(c4)C(F)(F)F)nc3c2)ccn1
InChI Key InChIKey=CUPDAZFMKZKJEG-UHFFFAOYSA-N
Data  1 IC50  1 EC50
  Tab Delimited (TSV)   2D SDfile   Computed 3D by Vconf -m prep SDfile
Find this compound or compounds like it in BindingDB:
Activity Spreadsheet -- Enzyme Inhibition Constant Data from BindingDB
Found 2 hits for monomerid = 50026694
TargetSerine/threonine-protein kinase B-raf(Homo sapiens (Human))
Novartis Institutes For Biomedical Research
Curated by ChEMBL
LigandPNGBDBM50026694(CHEMBL3335375)
Affinity DataEC50:  400nM. Assay description: Inhibition of BRAF (unknown origin)-mediated ERK phosphorylation by cell-based assay
In DepthDetails ArticlePubMed
TargetSerine/threonine-protein kinase B-raf(Homo sapiens (Human))
Novartis Institutes For Biomedical Research
Curated by ChEMBL
LigandPNGBDBM50026694(CHEMBL3335375)
Affinity DataIC50:  3nM. Assay description: Inhibition of BRAF V600E mutant (unknown origin)
In DepthDetails ArticlePubMed