BDBM50026699 CHEMBL1940292
SMILES O[C@]1(CN2CCC1CC2)C#Cc1ccc(Oc2ccc(cc2)C(=O)NCC2CCCCC2)cc1
InChI Key InChIKey=PLYGOFXFDNGSQZ-LJAQVGFWSA-N
Data  2 IC50
  Tab Delimited (TSV)   2D SDfile   Computed 3D by Vconf -m prep SDfile
Find this compound or compounds like it in BindingDB:
Activity Spreadsheet -- Enzyme Inhibition Constant Data from BindingDB
Found 2 hits for monomerid = 50026699
Target72 kDa type IV collagenase(Homo sapiens (Human))
Astrazeneca
Curated by ChEMBL
LigandPNGBDBM50026699(CHEMBL1940292)
Affinity DataIC50:  5.01E+3nM. Assay description: Inhibition of MMP2 using Mca-Pro-cyclohexyl-Ala-Gly-Nva-His-Ala- Dap(Dnp)-NH2 as substrate by fluorometric analysis
In DepthDetails ArticlePubMed
TargetCollagenase 3(Homo sapiens (Human))
Astrazeneca
Curated by ChEMBL
LigandPNGBDBM50026699(CHEMBL1940292)
Affinity DataIC50:  100nM. Assay description: Inhibition of recombinant human MMP13 using Mca-Pro-cyclohexyl-Ala-Gly-Nva-His-Ala- Dap(Dnp)-NH2 as substrate by fluorometric analysis
In DepthDetails ArticlePubMed