BDBM50026724 CHEMBL1940282
SMILES CS(=O)(=O)c1cccc(CNC(=O)c2ccc(Oc3ccc(cc3)C#C[C@]3(O)CN4CCC3CC4)cc2)c1
InChI Key InChIKey=IPGBSWJQXVYQBT-PMERELPUSA-N
Data  2 IC50
  Tab Delimited (TSV)   2D SDfile   Computed 3D by Vconf -m prep SDfile
Find this compound or compounds like it in BindingDB:
Activity Spreadsheet -- Enzyme Inhibition Constant Data from BindingDB
Found 2 hits for monomerid = 50026724
TargetCollagenase 3(Homo sapiens (Human))
Astrazeneca
Curated by ChEMBL
LigandPNGBDBM50026724(CHEMBL1940282)
Affinity DataIC50:  32nM. Assay description: Inhibition of recombinant human MMP13 using Mca-Pro-cyclohexyl-Ala-Gly-Nva-His-Ala- Dap(Dnp)-NH2 as substrate by fluorometric analysis
In DepthDetails ArticlePubMed
Target72 kDa type IV collagenase(Homo sapiens (Human))
Astrazeneca
Curated by ChEMBL
LigandPNGBDBM50026724(CHEMBL1940282)
Affinity DataIC50:  7.94E+3nM. Assay description: Inhibition of MMP2 using Mca-Pro-cyclohexyl-Ala-Gly-Nva-His-Ala- Dap(Dnp)-NH2 as substrate by fluorometric analysis
In DepthDetails ArticlePubMed