BDBM50026956 CHEMBL2370938
SMILES CCCC[C@H](NC(=O)[C@H](CCCCN)NC(=O)[C@H](CCCN=C(N)N)NC(=O)[C@H](CC(C)C)NC(=O)[C@](C)(CC(C)C)NC(=O)[C@H](Cc1c[nH]cn1)NC(=O)[C@@H](Cc1ccccc1)NC(=O)[C@H](CO)NC(=O)[C@H](CC(C)C)NC(=O)[C@H](CC(O)=O)NC(C)=O)C(=O)N[C@@H]([C@@H](C)CC)C(=O)N[C@@H](CCC(O)=O)C(=O)N[C@@H]([C@@H](C)CC)C(=O)N[C@@H](CCC(O)=O)C(=O)N[C@@H](CCCCN)C(=O)N[C@@H](CCC(N)=O)C(=O)N[C@@H](CCC(O)=O)C(=O)N[C@@H](CCCCN)C(=O)N[C@@H](CCC(O)=O)C(=O)N[C@@H](CCCCN)C(=O)N[C@@H](CCC(O)=O)C(=O)N[C@@H](CCC(N)=O)C(=O)N[C@@H](C)C(=O)N[C@@H](C)C(=O)N[C@@H](CCCCNC(C)=O)C(=O)N[C@@H](CC(N)=O)C(=O)N[C@@H](CCCN=C(N)N)C(=O)N[C@@H](CC(C)C)C(=O)N[C@@H](CC(C)C)C(=O)N[C@@H](CC(C)C)C(=O)N[C@@H](CC(O)=O)C(=O)N[C@@](C)(CC(C)C)C(=O)N[C@@H]([C@@H](C)CC)C(N)=O
InChI Key InChIKey=KBXXQHLYNYCQAE-OJVJHBBJSA-N
Data  2 IC50
  Tab Delimited (TSV)   2D SDfile   Computed 3D by Vconf -m prep SDfile
Find this compound or compounds like it in BindingDB:
Activity Spreadsheet -- Enzyme Inhibition Constant Data from BindingDB
Found 2 hits for monomerid = 50026956
TargetCorticotropin-releasing factor receptor 1(Homo sapiens (Human))
Salk Institute
Curated by ChEMBL
LigandPNGBDBM50026956(CHEMBL2370938)
Affinity DataIC50:  1.90nM. Assay description: Inhibition of recombinant corticotropin releasing factor receptor 1 assayed using nonselective [125I]-labeled agonist [Tyr0,Glu1,Nle17]-sauvagine
In DepthDetails ArticlePubMed
TargetCorticotropin-releasing factor receptor 2(Homo sapiens (Human))
Salk Institute
Curated by ChEMBL
LigandPNGBDBM50026956(CHEMBL2370938)
Affinity DataIC50:  0.720nM. Assay description: Inhibition of recombinant human corticotropin releasing factor receptor 2 beta (CRF2beta) assayed using nonselective [125I]-labeled agonist [Tyr0,Glu...
In DepthDetails ArticlePubMed