BDBM50027137 1-(5-Benzoylamino-4-hydroxyimino-6-phenyl-hexanoyl)-pyrrolidine-2-carboxylic acid::CHEMBL366727
SMILES ONC(CCC(=O)N1CCC[C@H]1C(O)=O)=C(Cc1ccccc1)NC(=O)c1ccccc1
InChI Key InChIKey=MHXJEKVJUXLGCM-NRFANRHFSA-N
Data  1 IC50
  Tab Delimited (TSV)   2D SDfile   Computed 3D by Vconf -m prep SDfile
Find this compound or compounds like it in BindingDB:
Activity Spreadsheet -- Enzyme Inhibition Constant Data from BindingDB
Found 1 hit for monomerid = 50027137
TargetAngiotensin-converting enzyme 2(Homo sapiens (Human))
TBA
Curated by ChEMBL
LigandPNGBDBM50027137(1-(5-Benzoylamino-4-hydroxyimino-6-phenyl-hexanoyl...)
Affinity DataIC50:  1.20E+3nM. Assay description: Concentration required to inhibit the activity of Angiotensin I converting enzyme by 50%
In DepthDetails ArticlePubMed