BDBM50027143 1-(5-Acetylamino-4-oxo-6-phenyl-hexanoyl)-pyrrolidine-2-carboxylic acid::CHEMBL172917
SMILES CC(=O)NC(Cc1ccccc1)C(=O)CCC(=O)N1CCC[C@H]1C(O)=O
InChI Key InChIKey=GUNQROGTUYRSGK-LYKKTTPLSA-N
Data  1 IC50
  Tab Delimited (TSV)   2D SDfile   Computed 3D by Vconf -m prep SDfile
Find this compound or compounds like it in BindingDB:
Activity Spreadsheet -- Enzyme Inhibition Constant Data from BindingDB
Found 1 hit for monomerid = 50027143
TargetAngiotensin-converting enzyme 2(Homo sapiens (Human))
TBA
Curated by ChEMBL
LigandPNGBDBM50027143(1-(5-Acetylamino-4-oxo-6-phenyl-hexanoyl)-pyrrolid...)
Affinity DataIC50:  330nM. Assay description: Concentration required to inhibit the activity of Angiotensin I converting enzyme by 50%
In DepthDetails ArticlePubMed