BDBM50027149 2-(5-Benzoylamino-4-oxo-6-phenyl-hexanoylamino)-3-phenyl-propionic acid benzyl ester::CHEMBL369590
SMILES O=C(CCC(=O)C(Cc1ccccc1)NC(=O)c1ccccc1)NC(Cc1ccccc1)C(=O)OCc1ccccc1
InChI Key InChIKey=WDLWGUAARSAWBF-UHFFFAOYSA-N
Data  1 IC50
  Tab Delimited (TSV)   2D SDfile   Computed 3D by Vconf -m prep SDfile
Find this compound or compounds like it in BindingDB:
Activity Spreadsheet -- Enzyme Inhibition Constant Data from BindingDB
Found 1 hit for monomerid = 50027149
TargetAngiotensin-converting enzyme 2(Homo sapiens (Human))
TBA
Curated by ChEMBL
LigandPNGBDBM50027149(2-(5-Benzoylamino-4-oxo-6-phenyl-hexanoylamino)-3-...)
Affinity DataIC50:  180nM. Assay description: Concentration required to inhibit the activity of Angiotensin I converting enzyme by 50%
In DepthDetails ArticlePubMed