BDBM50027189 CHEMBL381721
SMILES COc1cc2c(Nc3ncc(CC(=O)Nc4cccc(F)c4)s3)ncnc2cc1OCCCN1CCN(C)CC1
InChI Key InChIKey=SEJVDCGZEHMMFJ-UHFFFAOYSA-N
Data  1 IC50
  Tab Delimited (TSV)   2D SDfile   Computed 3D by Vconf -m prep SDfile
Find this compound or compounds like it in BindingDB:
Activity Spreadsheet -- Enzyme Inhibition Constant Data from BindingDB
Found 1 hit for monomerid = 50027189
TargetAurora kinase A(Homo sapiens (Human))
Astrazeneca
Curated by ChEMBL
LigandPNGBDBM50027189(CHEMBL381721)
Affinity DataIC50: <1nM. Assay description: Inhibition of Aurora A kinase activity
In DepthDetails ArticlePubMed