BDBM50027363 CHEBI:78420::Icariin
SMILES [#6]-[#8]-c1ccc(cc1)-c1oc2c(-[#6]\[#6]=[#6](\[#6])-[#6])c(-[#8]-[#6@@H]-3-[#8]-[#6@H](-[#6]-[#8])-[#6@@H](-[#8])-[#6@H](-[#8])-[#6@H]-3-[#8])cc(-[#8])c2c(=O)c1-[#8]-[#6@@H]-1-[#8]-[#6@@H](-[#6])-[#6@H](-[#8])-[#6@@H](-[#8])-[#6@H]-1-[#8]
InChI Key InChIKey=TZJALUIVHRYQQB-XLRXWWTNSA-N
Data  2 IC50
  Tab Delimited (TSV)   2D SDfile   Computed 3D by Vconf -m prep SDfile
Find this compound or compounds like it in BindingDB:
Activity Spreadsheet -- Enzyme Inhibition Constant Data from BindingDB
Found 2 hits for monomerid = 50027363
TargetLysine-specific histone demethylase 1A(Homo sapiens (Human))
China Pharmaceutical University
Curated by ChEMBL
LigandPNGBDBM50027363(CHEBI:78420 | Icariin)
Affinity DataIC50:  2.64E+4nM. Assay description: Inhibition of LSD1 (unknown origin) by fluorescence assay
In DepthDetails ArticlePubMed
TargetcGMP-specific 3',5'-cyclic phosphodiesterase(Homo sapiens (Human))
University Of Milan
Curated by ChEMBL
LigandPNGBDBM50027363(CHEBI:78420 | Icariin)
Affinity DataIC50:  5.90E+3nM. Assay description: Inhibition of human recombinant PDE5A1 expressed in COS7 cells
In DepthDetails ArticlePubMed