BDBM50027409 1N-(1,3-dimethylbutylcarbamoylmethyl)-2-[1-amino-2-(4-hydroxyphenyl)-(1S)-ethylcarboxamido]-4-methylsulfanyl-(2S)-butanamide::CHEMBL280274
SMILES CSCC[C@H](NC(=O)[C@@H](N)Cc1ccc(O)cc1)C(=O)NCC(=O)NC(C)CC(C)C
InChI Key InChIKey=VSKFBIBWZDLGMN-IROOXBOJSA-N
Data  2 IC50
  Tab Delimited (TSV)   2D SDfile   Computed 3D by Vconf -m prep SDfile
Find this compound or compounds like it in BindingDB:
Activity Spreadsheet -- Enzyme Inhibition Constant Data from BindingDB
Found 2 hits for monomerid = 50027409
TargetMu-type opioid receptor(GUINEA PIG)
TBA
Curated by ChEMBL
LigandPNGBDBM50027409(1N-(1,3-dimethylbutylcarbamoylmethyl)-2-[1-amino-2...)
Affinity DataIC50:  100nM. Assay description: Inhibitory potency against Opioid receptor mu 1 in longitudinal muscle preparation of guinea pig ileum
In DepthDetails ArticlePubMed
TargetDelta-type opioid receptor(MOUSE)
TBA
Curated by ChEMBL
LigandPNGBDBM50027409(1N-(1,3-dimethylbutylcarbamoylmethyl)-2-[1-amino-2...)
Affinity DataIC50:  1.10E+3nM. Assay description: Inhibitory potency against delta Opioid receptor delta 1 in longitudinal muscle preparation of mouse vas deferens
In DepthDetails ArticlePubMed