BDBM50027476 1-[2-(3-Benzoylamino-2-oxo-4-phenyl-butoxy)-acetyl]-pyrrolidine-2-carboxylic acid::CHEMBL366420
SMILES OC(=O)[C@H]1CCCN1C(=O)COCC(=O)C(Cc1ccccc1)NC(=O)c1ccccc1
InChI Key InChIKey=JEXNTKVTKDPTMQ-GFOWMXPYSA-N
Data  1 IC50
  Tab Delimited (TSV)   2D SDfile   Computed 3D by Vconf -m prep SDfile
Find this compound or compounds like it in BindingDB:
Activity Spreadsheet -- Enzyme Inhibition Constant Data from BindingDB
Found 1 hit for monomerid = 50027476
TargetAngiotensin-converting enzyme 2(Homo sapiens (Human))
TBA
Curated by ChEMBL
LigandPNGBDBM50027476(1-[2-(3-Benzoylamino-2-oxo-4-phenyl-butoxy)-acetyl...)
Affinity DataIC50:  4.40nM. Assay description: Concentration required for 50% inhibition of Angiotensin I converting enzyme
In DepthDetails ArticlePubMed