BDBM50027530 5,12-Dihydroxy-icosa-6,8,11,14-tetraenoic acid methyl ester(5,12-diHETE)::CHEMBL349755
SMILES CCCCCCC=CC(=O)CC\C=C/C=C/C(O)CCCC(=O)OC
InChI Key InChIKey=MQYDNBIUOXJPOA-APFFZGLCSA-N
Data  1 IC50
  Tab Delimited (TSV)   2D SDfile   Computed 3D by Vconf -m prep SDfile
Find this compound or compounds like it in BindingDB:
Activity Spreadsheet -- Enzyme Inhibition Constant Data from BindingDB
Found 1 hit for monomerid = 50027530
TargetPolyunsaturated fatty acid 5-lipoxygenase(Homo sapiens (Human))
TBA
Curated by ChEMBL
LigandPNGBDBM50027530(5,12-Dihydroxy-icosa-6,8,11,14-tetraenoic acid met...)
Affinity DataIC50:  2.00E+3nM. Assay description: Inhibitory activity against 5-lipoxygenase
In DepthDetails ArticlePubMed