BDBM50027629 1-[3-Acetylsulfanyl-4-(4-bromo-phenyl)-4-oxo-butyryl]-pyrrolidine-2-carboxylic acid::CHEMBL130237
SMILES CC(=O)SC(CC(=O)N1CCCC1C(O)=O)C(=O)c1ccc(Br)cc1
InChI Key InChIKey=OGAYJFQSMSLPAW-UHFFFAOYSA-N
Data  1 IC50
  Tab Delimited (TSV)   2D SDfile   Computed 3D by Vconf -m prep SDfile
Find this compound or compounds like it in BindingDB:
Activity Spreadsheet -- Enzyme Inhibition Constant Data from BindingDB
Found 1 hit for monomerid = 50027629
TargetAngiotensin-converting enzyme(Rattus norvegicus)
TBA
Curated by ChEMBL
LigandPNGBDBM50027629(1-[3-Acetylsulfanyl-4-(4-bromo-phenyl)-4-oxo-butyr...)
Affinity DataIC50:  131nM. Assay description: In vitro antihypertensive activity determined by inhibition of angiotensin I converting enzyme
In DepthDetails ArticlePubMed