BDBM50027675 CHEMBL3344385
SMILES OC(C1CCN(CCCOc2ccc(cc2)-c2ccccc2)CC1)(c1ccccc1)c1ccccc1
InChI Key InChIKey=HMGTWSUSNAFUEV-UHFFFAOYSA-N
Data  1 IC50
  Tab Delimited (TSV)   2D SDfile   Computed 3D by Vconf -m prep SDfile
Find this compound or compounds like it in BindingDB:
Activity Spreadsheet -- Enzyme Inhibition Constant Data from BindingDB
Found 1 hit for monomerid = 50027675
TargetPotassium voltage-gated channel subfamily H member 2(Homo sapiens (Human))
University Of Rochester Medical Center
Curated by ChEMBL
LigandPNGBDBM50027675(CHEMBL3344385)
Affinity DataIC50:  140nM. Assay description: Displacement of [3H]astemizole from human ERG expressed in HEK293 cells by scintillation counting method
In DepthDetails ArticlePubMed