BDBM50027768 CHEMBL392182
SMILES CCCOc1ccc(NC(=O)CC)cc1-c1nc2c(CCC)nn(C)c2c(=O)[nH]1
InChI Key InChIKey=XGEQSYPTAMLBDX-UHFFFAOYSA-N
Data  1 IC50
  Tab Delimited (TSV)   2D SDfile   Computed 3D by Vconf -m prep SDfile
Find this compound or compounds like it in BindingDB:
Activity Spreadsheet -- Enzyme Inhibition Constant Data from BindingDB
Found 1 hit for monomerid = 50027768
TargetcGMP-specific 3',5'-cyclic phosphodiesterase(Homo sapiens (Human))
Sungkyunkwan University
Curated by ChEMBL
LigandPNGBDBM50027768(CHEMBL392182)
Affinity DataIC50:  0.380nM. Assay description: Inhibition of PDE5
In DepthDetails ArticlePubMed