BDBM50027862 CHEMBL2322990
SMILES [H][C@@]1(CC[C@@]2([H])[C@]3([H])CC[C@]4([H])C[C@H](O)CC[C@]4(C)[C@@]3([H])CC[C@]12C)[C@H](C)CCC(=O)N[C@H](Cc1c[nH]c2ccccc12)C(O)=O
InChI Key InChIKey=ITOFPJRDSCGOSA-UZPHBQCWSA-N
Data  1 IC50
  Tab Delimited (TSV)   2D SDfile   Computed 3D by Vconf -m prep SDfile
Find this compound or compounds like it in BindingDB:
Activity Spreadsheet -- Enzyme Inhibition Constant Data from BindingDB
Found 1 hit for monomerid = 50027862
TargetEphrin type-A receptor 2(Homo sapiens (Human))
Universit£
Curated by ChEMBL
LigandPNGBDBM50027862(CHEMBL2322990)
Affinity DataIC50:  2.04E+4nM. Assay description: Inhibition of ephrin-A1-Fc binding to EphA2-Fc receptor (unknown origin) after 1 hr by ELISA
In DepthDetails ArticlePubMed