BDBM50027893 (3S,5S)-methyl 2-[1-(4-amino-2-hydroxy-6-methylheptylcarboxamido)-2-methyl-propylcarboxamido]-3-phenyl-propanoate::CHEMBL558204
SMILES COC(=O)[C@@H](Cc1ccccc1)NC(=O)[C@H](NC(=O)CC(O)CC(N)CC(C)C)C(C)C
InChI Key InChIKey=RCZVWNRAXBXPPY-FLQRSKGTSA-N
Data  4 KI
  Tab Delimited (TSV)   2D SDfile   Computed 3D by Vconf -m prep SDfile
Find this compound or compounds like it in BindingDB:
Activity Spreadsheet -- Enzyme Inhibition Constant Data from BindingDB
Found 4 hits for monomerid = 50027893
TargetRenin(Homo sapiens (Human))
TBA
Curated by ChEMBL
LigandPNGBDBM50027893((3S,5S)-methyl 2-[1-(4-amino-2-hydroxy-6-methylhep...)
Affinity DataKi:  9.50E+4nM. Assay description: Inhibitory activity against human amniotic renin (competitive inhibition)
In DepthDetails ArticlePubMed
TargetRenin(Homo sapiens (Human))
TBA
Curated by ChEMBL
LigandPNGBDBM50027893((3S,5S)-methyl 2-[1-(4-amino-2-hydroxy-6-methylhep...)
Affinity DataKi:  1.70E+5nM. Assay description: Inhibitory activity against human amniotic renin (competitive inhibition)
In DepthDetails ArticlePubMed
TargetRenin(Homo sapiens (Human))
TBA
Curated by ChEMBL
LigandPNGBDBM50027893((3S,5S)-methyl 2-[1-(4-amino-2-hydroxy-6-methylhep...)
Affinity DataKi:  1.18E+6nM. Assay description: Inhibitory activity against hog kidney renin (Non-competitive inhibition)
In DepthDetails ArticlePubMed
TargetRenin(Homo sapiens (Human))
TBA
Curated by ChEMBL
LigandPNGBDBM50027893((3S,5S)-methyl 2-[1-(4-amino-2-hydroxy-6-methylhep...)
Affinity DataKi:  1.60E+6nM. Assay description: Inhibitory activity against hog kidney renin (Non-competitive inhibition)
In DepthDetails ArticlePubMed