BDBM50028429 2-Amino-3,5,6,7-tetrahydro-pyrimido[4,5-b][1,4]thiazin-4-one::CHEMBL149584
SMILES Nc1nc2SCCNc2c(=O)[nH]1
InChI Key InChIKey=RWOIJJABCIICLS-UHFFFAOYSA-N
Data  1 KI
  Tab Delimited (TSV)   2D SDfile   Computed 3D by Vconf -m prep SDfile
Find this compound or compounds like it in BindingDB:
Activity Spreadsheet -- Enzyme Inhibition Constant Data from BindingDB
Found 1 hit for monomerid = 50028429
TargetPhenylalanine-4-hydroxylase(Rattus norvegicus)
TBA
Curated by ChEMBL
LigandPNGBDBM50028429(2-Amino-3,5,6,7-tetrahydro-pyrimido[4,5-b][1,4]thi...)
Affinity DataKi:  5.00E+5nM. Assay description: Tested for competitive binding inhibition against phenylalanine hydroxylase in rat liver
In DepthDetails ArticlePubMed