BDBM50028443 CHEMBL3355117
SMILES C[C@H]1N2C(COc3cc(-c4ccccc4)c(cc23)N(C)C2(C)CN(C)C2)=NNC1=O
InChI Key InChIKey=RGCJJZQGWXZHJQ-OAHLLOKOSA-N
Data  1 IC50
PDB links: 1 PDB ID matches this monomer.
  Tab Delimited (TSV)   2D SDfile   Computed 3D by Vconf -m prep SDfile
Find this compound or compounds like it in BindingDB:
Activity Spreadsheet -- Enzyme Inhibition Constant Data from BindingDB
Found 1 hit for monomerid = 50028443
TargetProtein kinase C theta type(Homo sapiens (Human))
Abbvie Bioresearch Center
Curated by ChEMBL
LigandPNGBDBM50028443(CHEMBL3355117)
Affinity DataIC50:  4nM. Assay description: Inhibition of human recombinant PKCtheta expressed in Sf21 cells using Bio-cdc peptide substrate and ATP after 60 mins by time-resolved fluorescence ...