BDBM50028588 1-(4-Hydroxy-5-hydroxymethyl-tetrahydro-furan-2-yl)-3,5-dimethyl-1H-pyrimidine-2,4-dione::3-methylthymidine::CHEMBL160884
SMILES Cc1cn([C@H]2C[C@H](O)[C@@H](CO)O2)c(=O)n(C)c1=O
InChI Key InChIKey=JCVDICFLPGDHAT-UHFFFAOYSA-N
Data  2 KI
PDB links: 1 PDB ID matches this monomer.
  Tab Delimited (TSV)   2D SDfile   Computed 3D by Vconf -m prep SDfile
Find this compound or compounds like it in BindingDB:
Activity Spreadsheet -- Enzyme Inhibition Constant Data from BindingDB
Found 2 hits for monomerid = 50028588
TargetThymidine kinase, cytosolic(Rattus norvegicus)
TBA
Curated by ChEMBL
LigandPNGBDBM50028588(1-(4-Hydroxy-5-hydroxymethyl-tetrahydro-furan-2-yl...)
Affinity DataKi:  2.50E+5nM. Assay description: Inhibition of H-Ras-mediated farnesylation expressed in mouse NIH3T3 cells
In DepthDetails ArticlePubMed
TargetThymidine kinase, cytosolic(Rattus norvegicus)
TBA
Curated by ChEMBL
LigandPNGBDBM50028588(1-(4-Hydroxy-5-hydroxymethyl-tetrahydro-furan-2-yl...)
Affinity DataKi:  2.80E+7nM. Assay description: Non-competitive inhibition against rat mitochondrial thymidine kinase
In DepthDetails ArticlePubMed