BDBM50028629 2-Cyclooctyl-1-methyl-ethylamine::CHEMBL19161
SMILES C[C@@H](N)CC1CCCCCCC1
InChI Key InChIKey=LGIMXTCWSDSTPO-SNVBAGLBSA-N
Data  1 KI
  Tab Delimited (TSV)   2D SDfile   Computed 3D by Vconf -m prep SDfile
Find this compound or compounds like it in BindingDB:
Activity Spreadsheet -- Enzyme Inhibition Constant Data from BindingDB
Found 1 hit for monomerid = 50028629
TargetPhenylethanolamine N-methyltransferase(Bos taurus (bovine))
TBA
Curated by ChEMBL
LigandPNGBDBM50028629(2-Cyclooctyl-1-methyl-ethylamine | CHEMBL19161)
Affinity DataKi:  1.57E+5nM. Assay description: Inhibitory activity against Norepinephrine N-methyltransferase of bovine adrenal glands
In DepthDetails ArticlePubMed