BDBM50028773 8-Pyridin-3-yl-octanoic acid; hydrochloride::CHEMBL543725
SMILES OC(=O)CCCCCCCc1cccnc1
InChI Key InChIKey=LJLBRHMJMSVGHF-UHFFFAOYSA-N
Data  1 IC50
  Tab Delimited (TSV)   2D SDfile   Computed 3D by Vconf -m prep SDfile
Find this compound or compounds like it in BindingDB:
Activity Spreadsheet -- Enzyme Inhibition Constant Data from BindingDB
Found 1 hit for monomerid = 50028773
TargetThromboxane-A synthase(Homo sapiens (Human))
TBA
Curated by ChEMBL
LigandPNGBDBM50028773(8-Pyridin-3-yl-octanoic acid; hydrochloride | CHEM...)
Affinity DataIC50:  76nM. Assay description: Inhibitory activity against Thromboxane synthetase
In DepthDetails ArticlePubMed