BDBM50028795 2-Amino-1-cycloocta-1,5-dienyl-ethanol::CHEMBL275390
SMILES NCC(O)C1=C/CC\C=C/CC\1
InChI Key InChIKey=PZFXHRKJENHBSF-UYIJSCIWSA-N
Data  1 IC50
  Tab Delimited (TSV)   2D SDfile   Computed 3D by Vconf -m prep SDfile
Find this compound or compounds like it in BindingDB:
Activity Spreadsheet -- Enzyme Inhibition Constant Data from BindingDB
Found 1 hit for monomerid = 50028795
TargetPhenylethanolamine N-methyltransferase(Bos taurus (bovine))
TBA
Curated by ChEMBL
LigandPNGBDBM50028795(2-Amino-1-cycloocta-1,5-dienyl-ethanol | CHEMBL275...)
Affinity DataIC50:  8.90E+4nM. Assay description: Inhibitory activity against phenylethanolamine N-methyltransferase
In DepthDetails ArticlePubMed