BDBM50028831 CHEMBL18607::Cycloheptanone
SMILES O=C1CCCCCC1
InChI Key InChIKey=CGZZMOTZOONQIA-UHFFFAOYSA-N
Data  1 IC50
  Tab Delimited (TSV)   2D SDfile   Computed 3D by Vconf -m prep SDfile
Find this compound or compounds like it in BindingDB:
Activity Spreadsheet -- Enzyme Inhibition Constant Data from BindingDB
Found 1 hit for monomerid = 50028831
TargetPhenylethanolamine N-methyltransferase(Bos taurus (bovine))
TBA
Curated by ChEMBL
LigandPNGBDBM50028831(CHEMBL18607 | Cycloheptanone)
Affinity DataIC50:  5.10E+5nM. Assay description: Inhibitory activity against phenylethanolamine N-methyltransferase
In DepthDetails ArticlePubMed