BDBM50029049 CHEMBL3343247
SMILES O=C(Nc1ccccn1)[C@@H]1C[C@@]1(COc1ccccc1)c1ccccc1
InChI Key InChIKey=LAKQOAUEGYDUHQ-SIKLNZKXSA-N
Data  2 KI
  Tab Delimited (TSV)   2D SDfile   Computed 3D by Vconf -m prep SDfile
Find this compound or compounds like it in BindingDB:
Activity Spreadsheet -- Enzyme Inhibition Constant Data from BindingDB
Found 2 hits for monomerid = 50029049
TargetOrexin receptor type 2(Homo sapiens (Human))
Eisai
Curated by ChEMBL
LigandPNGBDBM50029049(CHEMBL3343247)
Affinity DataKi:  967nM. Assay description: Displacement of [125I]-Orexin A from human OX2R expressed in CHO cells after 30 mins by topcount analysis
In DepthDetails ArticlePubMed
TargetOrexin/Hypocretin receptor type 1(Homo sapiens (Human))
Eisai
Curated by ChEMBL
LigandPNGBDBM50029049(CHEMBL3343247)
Affinity DataKi:  6.84E+3nM. Assay description: Displacement of [125I]-Orexin A from human OX1R expressed in CHO cells after 30 mins by topcount analysis
In DepthDetails ArticlePubMed