BDBM50029135 CHEMBL3361435
SMILES NC(=N)NCC(=O)NCC1(Cc2ccc3ccccc3c2)CCN(Cc2ccccc2)CC1
InChI Key InChIKey=KWCCRLUVBBXLLW-UHFFFAOYSA-N
Data  2 KI
  Tab Delimited (TSV)   2D SDfile   Computed 3D by Vconf -m prep SDfile
Find this compound or compounds like it in BindingDB:
Activity Spreadsheet -- Enzyme Inhibition Constant Data from BindingDB
Found 2 hits for monomerid = 50029135
TargetNeuropeptide FF receptor 2(Homo sapiens (Human))
The University Of Mississippi
Curated by ChEMBL
LigandPNGBDBM50029135(CHEMBL3361435)
Affinity DataKi:  205nM. Assay description: Displacement of [3H]EYF from human NPFF2 receptor expressed in CHO cells after 1 hr by liquid scintillation counting analysis
In DepthDetails ArticlePubMed
TargetNeuropeptide FF receptor 1(Homo sapiens (Human))
The University Of Mississippi
Curated by ChEMBL
LigandPNGBDBM50029135(CHEMBL3361435)
Affinity DataKi:  316nM. Assay description: Displacement of [3H]NPVF from human NPFF1 receptor expressed in CHO cells after 1 hr by liquid scintillation counting analysis
In DepthDetails ArticlePubMed